Unit Test Results.

Downloads / Build / Test Results | org.eclipse.debug.tests_ep48I-unit-win32_win32.win32.x86_8.0.xmlDesigned for use with JUnit and Ant.

Summary

TestsFailuresErrorsSuccess rateTime
2340299.15%300.502
Note: failures are anticipated and checked for with assertions while errors are unanticipated.

Packages

Note: package statistics are not computed recursively, they only sum up all of its testsuites numbers.
NameTestsErrorsFailuresTime(s)Time StampHost
org.eclipse.debug.tests23420300.5022017-09-14T06:41:41WINSLAVE

Package org.eclipse.debug.tests

NameTestsErrorsFailuresTime(s)Time StampHost
AutomatedSuite23420300.5022017-09-14T06:41:41WINSLAVE
Back to top


TestCase AutomatedSuite

NameStatusTypeTime(s)
testLookupStackframeForceSuccess0.421
testLRUSuccess0.009
testLookupStackframeWithDebugElement1Success0.009
testLookupStackframeWithDebugElement2Success0.008
testLookupStackframeWithDebugElement3Success0.008
testLookupStackframeWithDebugElement4Success0.008
testLookupStackframeWithDebugElement5Success0.008
testLookupStringLocatorNoForceSuccess0.009
testLookupStringForceSuccess0.009
testLookupStackframeNoForceSuccess0.007
testLookupStringNoLocatorNoForceSuccess0.008
testLookupStringNoForceSuccess0.021
testBreakpointOrdering0Success0.056
testBreakpointOrdering1Success0.025
testBreakpointOrdering2Success0.027
testBreakpointOrdering3Success0.013
testInsertAndRemoveSuccess0.228
testInsertAndSelectSuccess0.207
testUpdateLabelSuccess0.209
testExpandAndSelect_simpleSuccess0.180
testCompositeModelAddElementSuccess0.379
testAddElementSuccess0.175
testRefreshStruct2Success0.185
testBug292322Success0.223
testRefreshStructSuccess0.223
testRefreshCoalesceStructSuccess0.161
testInsertSuccess0.168
testCompositeModelRefreshStructSuccess0.297
testRemoveSuccess0.156
testExpandAndSelectSuccess0.159
testLabelUpdatesCompletedOutOfSequence1Success0.099
testLabelUpdatesCompletedOutOfSequence2Success0.105
testSimpleSingleLevelSuccess0.147
testSimpleMultiLevelSuccess0.152
testSuccess0.097
testSelectionPolicySuccess0.144
testSelectRemoveRefreshStructSuccess0.155
testSelectRemoveSuccess0.154
testSimpleSetSelectionSuccess0.144
testSaveAndRestore1Success0.215
testSaveAndRestore2Success0.153
testPreserveExpandedOnInsertSuccess0.177
testPreserveExpandedOnRemoveSuccess0.198
testPreserveExpandedOnMultLevelContentSuccess0.152
testPreserveLargeModelOnContentSuccess0.267
testSaveAndRestorePartialStateLargeSuccess0.154
testSaveRestoreOrderSuccess0.170
testPreserveExpandDeltaAfterContentSuccess0.251
testPreserveCollapseAndSelectDeltaAfterSaveAndRestoreSuccess0.252
testUpdateWithNullInputSuccess0.149
testUpdateViewerSuccess0.094
testSaveAndRestoreInputInstanceEqualsSuccess0.174
testSaveAndRestoreLargeSuccess0.202
testSaveAndRestoreInputInstanceSuccess0.166
testPreserveCollapseDeltaAfterContentSuccess0.156
testPreserveSelectionDeltaAfterContentSuccess0.149
testPreserveExpandedOnSubTreeContentSuccess0.147
testPreserveExpandedOnContentStressSuccess0.263
testAddNewChildrenSuccess0.205
testRescheduleUpdatesSuccess0.183
testCanceledUpdates1Success0.163
testCanceledUpdates2Success0.171
testCanceledUpdates3Success0.189
testCanceledUpdates4Success0.193
testNotifyUpdatesTartedOnModelChangedSuccess0.152
testInsertAtInvalidIndexSuccess0.144
testRepeatedAddRemoveElementSuccess0.180
testCanceledUpdatesOnSetNullInputSuccess0.172
testCancelUpdatesOnRemoveElementWhileUpdatingSubTreeSuccess0.168
testRemoveElementsSuccess0.167
testContentPlusAddRemoveUpdateRaceConditionsElementSuccess0.414
testCanceledUpdatesOnSetInputSuccess0.144
testLargeSingleLevelSuccess0.180
testSimpleMultiLevelWithMixedFiltersSuccess0.159
testSimpleSingleLevelWithTMVFilterSuccess0.175
testPreserveExpandedOnMultLevelContentSuccess0.153
testRefreshToUnfilterElementsWithMixedFiltersSuccess0.108
testReplacedUnrealizedFilteredElementSuccess0.128
testSimpleSingleLevelSuccess0.195
testRefreshUnrealizedFilteredElementWithTMVFilterSuccess0.101
testRefreshToUnfilterElementsSuccess0.093
testRefreshToUnfilterElementsWithTMVFilterErrorTest failed: Timed Out: Viewer Update Listener fLabelUpdatesComplete = 4 fLabelUpdatesCompleteAtReset = 4 fLabelUpdatesRunning = 0 fLabelUpdates = (EMPTY) fViewerUpdatesStarted = 1 fViewerUpdatesRunning = 0 fViewerUpdatesComplete = 1 fViewerUpdatesCompleteAtReset = 1 fHasChildrenUpdates = (EMPTY) fChildCountUpdates = (EMPTY) fChildrenUpdates = (EMPTY) fProxyModels = [] fTimeoutInterval = 60000 fTimeoutTime = 1505371373509Current Time = 1505371373510 fListener = Viewer Update Listener fLabelUpdatesComplete = 4 fLabelUpdatesCompleteAtReset = 4 fLabelUpdatesRunning = 0 fLabelUpdatesStarted = 4 fLabelUpdatesCompleted = [] fLabelUpdates = (EMPTY) fViewerUpdatesStarted = 1 fViewerUpdatesRunning = 0 fViewerUpdatesComplete = 1 fViewerUpdatesCompleteAtReset = 1 fHasChildrenUpdatesRunning = [] fHasChildrenUpdatesCompleted = [] fHasChildrenUpdates = (EMPTY) fChildCountUpdatesRunning = [] fChildCountUpdatesCompleted = [] fChildCountUpdates = (EMPTY) fChildrenUpdatesRunning = [] fChildrenUpdatesCompleted = [] fChildrenUpdates = (EMPTY) fModelChangedComplete = true fStateSaveComplete = false fStateRestoreComplete = false fProxyModels = [] fStateUpdates = (EMPTY) fTimeoutInterval = 60000 fTimeoutTime = 1505371373509Current Time = 1505371373511

org.eclipse.core.commands.ExecutionException: Test failed: Timed Out: Viewer Update Listener
fLabelUpdatesComplete = 4
fLabelUpdatesCompleteAtReset = 4
fLabelUpdatesRunning = 0
fLabelUpdates = (EMPTY)
fViewerUpdatesStarted = 1
fViewerUpdatesRunning = 0
fViewerUpdatesComplete = 1
fViewerUpdatesCompleteAtReset = 1
fHasChildrenUpdates = (EMPTY)
fChildCountUpdates = (EMPTY)
fChildrenUpdates = (EMPTY)
fProxyModels = []
fTimeoutInterval = 60000
fTimeoutTime = 1505371373509Current Time = 1505371373510
fListener = Viewer Update Listener
fLabelUpdatesComplete = 4
fLabelUpdatesCompleteAtReset = 4
fLabelUpdatesRunning = 0
fLabelUpdatesStarted = 4
fLabelUpdatesCompleted = []
fLabelUpdates = (EMPTY)
fViewerUpdatesStarted = 1
fViewerUpdatesRunning = 0
fViewerUpdatesComplete = 1
fViewerUpdatesCompleteAtReset = 1
fHasChildrenUpdatesRunning = []
fHasChildrenUpdatesCompleted = []
fHasChildrenUpdates = (EMPTY)
fChildCountUpdatesRunning = []
fChildCountUpdatesCompleted = []
fChildCountUpdates = (EMPTY)
fChildrenUpdatesRunning = []
fChildrenUpdatesCompleted = []
fChildrenUpdates = (EMPTY)
fModelChangedComplete = true
fStateSaveComplete = false
fStateRestoreComplete = false
fProxyModels = []
fStateUpdates = (EMPTY)
fTimeoutInterval = 60000
fTimeoutTime = 1505371373509Current Time = 1505371373511
at org.eclipse.debug.tests.viewer.model.FilterTests.runTest(FilterTests.java:94)
at org.eclipse.test.EclipseTestRunner.run(EclipseTestRunner.java:749)
at org.eclipse.test.EclipseTestRunner.run(EclipseTestRunner.java:350)
at org.eclipse.test.UITestApplication.lambda$0(UITestApplication.java:195)
at org.eclipse.test.UITestApplication$$Lambda$283/11861104.run(Unknown Source)
at org.eclipse.swt.widgets.RunnableLock.run(RunnableLock.java:37)
at org.eclipse.swt.widgets.Synchronizer.runAsyncMessages(Synchronizer.java:182)
at org.eclipse.swt.widgets.Display.runAsyncMessages(Display.java:4213)
at org.eclipse.swt.widgets.Display.readAndDispatch(Display.java:3820)
at org.eclipse.e4.ui.internal.workbench.swt.PartRenderingEngine$5.run(PartRenderingEngine.java:1150)
at org.eclipse.core.databinding.observable.Realm.runWithDefault(Realm.java:336)
at org.eclipse.e4.ui.internal.workbench.swt.PartRenderingEngine.run(PartRenderingEngine.java:1039)
at org.eclipse.e4.ui.internal.workbench.E4Workbench.createAndRunUI(E4Workbench.java:153)
at org.eclipse.ui.internal.Workbench.lambda$3(Workbench.java:680)
at org.eclipse.ui.internal.Workbench$$Lambda$15/25204497.run(Unknown Source)
at org.eclipse.core.databinding.observable.Realm.runWithDefault(Realm.java:336)
at org.eclipse.ui.internal.Workbench.createAndRunWorkbench(Workbench.java:594)
at org.eclipse.ui.PlatformUI.createAndRunWorkbench(PlatformUI.java:148)
at org.eclipse.ui.internal.ide.application.IDEApplication.start(IDEApplication.java:151)
at org.eclipse.test.UITestApplication.runApplication(UITestApplication.java:139)
at org.eclipse.test.UITestApplication.run(UITestApplication.java:61)
at org.eclipse.test.UITestApplication.start(UITestApplication.java:210)
at org.eclipse.equinox.internal.app.EclipseAppHandle.run(EclipseAppHandle.java:196)
at org.eclipse.core.runtime.internal.adaptor.EclipseAppLauncher.runApplication(EclipseAppLauncher.java:134)
at org.eclipse.core.runtime.internal.adaptor.EclipseAppLauncher.start(EclipseAppLauncher.java:104)
at org.eclipse.core.runtime.adaptor.EclipseStarter.run(EclipseStarter.java:388)
at org.eclipse.core.runtime.adaptor.EclipseStarter.run(EclipseStarter.java:243)
at org.eclipse.equinox.launcher.Main.invokeFramework(Main.java:653)
at org.eclipse.equinox.launcher.Main.basicRun(Main.java:590)
at org.eclipse.equinox.launcher.Main.run(Main.java:1499)
at org.eclipse.equinox.launcher.Main.main(Main.java:1472)
at org.eclipse.core.launcher.Main.main(Main.java:34)
Caused by: java.lang.RuntimeException: Timed Out: Viewer Update Listener
fLabelUpdatesComplete = 4
fLabelUpdatesCompleteAtReset = 4
fLabelUpdatesRunning = 0
fLabelUpdates = (EMPTY)
fViewerUpdatesStarted = 1
fViewerUpdatesRunning = 0
fViewerUpdatesComplete = 1
fViewerUpdatesCompleteAtReset = 1
fHasChildrenUpdates = (EMPTY)
fChildCountUpdates = (EMPTY)
fChildrenUpdates = (EMPTY)
fProxyModels = []
fTimeoutInterval = 60000
fTimeoutTime = 1505371373509Current Time = 1505371373510
at org.eclipse.debug.tests.viewer.model.TestModelUpdatesListener.isFinished(TestModelUpdatesListener.java:445)
at org.eclipse.debug.tests.viewer.model.FilterTests.doTestRefreshToUnfilterElements(FilterTests.java:401)
at org.eclipse.debug.tests.viewer.model.FilterTests.testRefreshToUnfilterElementsWithTMVFilter(FilterTests.java:362)
at org.eclipse.debug.tests.viewer.model.FilterTests.runTest(FilterTests.java:92)
60.161
testReplacedUnrealizedFilteredElementWithTMVFilterSuccess0.119
testSimpleMultiLevelSuccess0.203
testLargeSingleLevelWithTMVFilterSuccess0.136
testSimpleSingleLevelWithMixedFiltersSuccess0.203
testSimpleMultiLevelWithTMVFilterSuccess0.147
testRefreshUnrealizedFilteredElementErrorTest failed: Timed Out: Viewer Update Listener fLabelUpdatesComplete = 3 fLabelUpdatesCompleteAtReset = 3 fLabelUpdatesRunning = 0 fLabelUpdates = (EMPTY) fViewerUpdatesStarted = 1 fViewerUpdatesRunning = 0 fViewerUpdatesComplete = 1 fViewerUpdatesCompleteAtReset = 1 fHasChildrenUpdates = (EMPTY) fChildCountUpdates = (EMPTY) fChildrenUpdates = (EMPTY) fProxyModels = [] fTimeoutInterval = 60000 fTimeoutTime = 1505371434481Current Time = 1505371434482 fListener = Viewer Update Listener fLabelUpdatesComplete = 3 fLabelUpdatesCompleteAtReset = 3 fLabelUpdatesRunning = 0 fLabelUpdatesStarted = 3 fLabelUpdatesCompleted = [] fLabelUpdates = (EMPTY) fViewerUpdatesStarted = 1 fViewerUpdatesRunning = 0 fViewerUpdatesComplete = 1 fViewerUpdatesCompleteAtReset = 1 fHasChildrenUpdatesRunning = [] fHasChildrenUpdatesCompleted = [] fHasChildrenUpdates = (EMPTY) fChildCountUpdatesRunning = [] fChildCountUpdatesCompleted = [] fChildCountUpdates = (EMPTY) fChildrenUpdatesRunning = [] fChildrenUpdatesCompleted = [] fChildrenUpdates = (EMPTY) fModelChangedComplete = true fStateSaveComplete = false fStateRestoreComplete = false fProxyModels = [] fStateUpdates = (EMPTY) fTimeoutInterval = 60000 fTimeoutTime = 1505371434481Current Time = 1505371434483

org.eclipse.core.commands.ExecutionException: Test failed: Timed Out: Viewer Update Listener
fLabelUpdatesComplete = 3
fLabelUpdatesCompleteAtReset = 3
fLabelUpdatesRunning = 0
fLabelUpdates = (EMPTY)
fViewerUpdatesStarted = 1
fViewerUpdatesRunning = 0
fViewerUpdatesComplete = 1
fViewerUpdatesCompleteAtReset = 1
fHasChildrenUpdates = (EMPTY)
fChildCountUpdates = (EMPTY)
fChildrenUpdates = (EMPTY)
fProxyModels = []
fTimeoutInterval = 60000
fTimeoutTime = 1505371434481Current Time = 1505371434482
fListener = Viewer Update Listener
fLabelUpdatesComplete = 3
fLabelUpdatesCompleteAtReset = 3
fLabelUpdatesRunning = 0
fLabelUpdatesStarted = 3
fLabelUpdatesCompleted = []
fLabelUpdates = (EMPTY)
fViewerUpdatesStarted = 1
fViewerUpdatesRunning = 0
fViewerUpdatesComplete = 1
fViewerUpdatesCompleteAtReset = 1
fHasChildrenUpdatesRunning = []
fHasChildrenUpdatesCompleted = []
fHasChildrenUpdates = (EMPTY)
fChildCountUpdatesRunning = []
fChildCountUpdatesCompleted = []
fChildCountUpdates = (EMPTY)
fChildrenUpdatesRunning = []
fChildrenUpdatesCompleted = []
fChildrenUpdates = (EMPTY)
fModelChangedComplete = true
fStateSaveComplete = false
fStateRestoreComplete = false
fProxyModels = []
fStateUpdates = (EMPTY)
fTimeoutInterval = 60000
fTimeoutTime = 1505371434481Current Time = 1505371434483
at org.eclipse.debug.tests.viewer.model.FilterTests.runTest(FilterTests.java:94)
at org.eclipse.test.EclipseTestRunner.run(EclipseTestRunner.java:749)
at org.eclipse.test.EclipseTestRunner.run(EclipseTestRunner.java:350)
at org.eclipse.test.UITestApplication.lambda$0(UITestApplication.java:195)
at org.eclipse.test.UITestApplication$$Lambda$283/11861104.run(Unknown Source)
at org.eclipse.swt.widgets.RunnableLock.run(RunnableLock.java:37)
at org.eclipse.swt.widgets.Synchronizer.runAsyncMessages(Synchronizer.java:182)
at org.eclipse.swt.widgets.Display.runAsyncMessages(Display.java:4213)
at org.eclipse.swt.widgets.Display.readAndDispatch(Display.java:3820)
at org.eclipse.e4.ui.internal.workbench.swt.PartRenderingEngine$5.run(PartRenderingEngine.java:1150)
at org.eclipse.core.databinding.observable.Realm.runWithDefault(Realm.java:336)
at org.eclipse.e4.ui.internal.workbench.swt.PartRenderingEngine.run(PartRenderingEngine.java:1039)
at org.eclipse.e4.ui.internal.workbench.E4Workbench.createAndRunUI(E4Workbench.java:153)
at org.eclipse.ui.internal.Workbench.lambda$3(Workbench.java:680)
at org.eclipse.ui.internal.Workbench$$Lambda$15/25204497.run(Unknown Source)
at org.eclipse.core.databinding.observable.Realm.runWithDefault(Realm.java:336)
at org.eclipse.ui.internal.Workbench.createAndRunWorkbench(Workbench.java:594)
at org.eclipse.ui.PlatformUI.createAndRunWorkbench(PlatformUI.java:148)
at org.eclipse.ui.internal.ide.application.IDEApplication.start(IDEApplication.java:151)
at org.eclipse.test.UITestApplication.runApplication(UITestApplication.java:139)
at org.eclipse.test.UITestApplication.run(UITestApplication.java:61)
at org.eclipse.test.UITestApplication.start(UITestApplication.java:210)
at org.eclipse.equinox.internal.app.EclipseAppHandle.run(EclipseAppHandle.java:196)
at org.eclipse.core.runtime.internal.adaptor.EclipseAppLauncher.runApplication(EclipseAppLauncher.java:134)
at org.eclipse.core.runtime.internal.adaptor.EclipseAppLauncher.start(EclipseAppLauncher.java:104)
at org.eclipse.core.runtime.adaptor.EclipseStarter.run(EclipseStarter.java:388)
at org.eclipse.core.runtime.adaptor.EclipseStarter.run(EclipseStarter.java:243)
at org.eclipse.equinox.launcher.Main.invokeFramework(Main.java:653)
at org.eclipse.equinox.launcher.Main.basicRun(Main.java:590)
at org.eclipse.equinox.launcher.Main.run(Main.java:1499)
at org.eclipse.equinox.launcher.Main.main(Main.java:1472)
at org.eclipse.core.launcher.Main.main(Main.java:34)
Caused by: java.lang.RuntimeException: Timed Out: Viewer Update Listener
fLabelUpdatesComplete = 3
fLabelUpdatesCompleteAtReset = 3
fLabelUpdatesRunning = 0
fLabelUpdates = (EMPTY)
fViewerUpdatesStarted = 1
fViewerUpdatesRunning = 0
fViewerUpdatesComplete = 1
fViewerUpdatesCompleteAtReset = 1
fHasChildrenUpdates = (EMPTY)
fChildCountUpdates = (EMPTY)
fChildrenUpdates = (EMPTY)
fProxyModels = []
fTimeoutInterval = 60000
fTimeoutTime = 1505371434481Current Time = 1505371434482
at org.eclipse.debug.tests.viewer.model.TestModelUpdatesListener.isFinished(TestModelUpdatesListener.java:445)
at org.eclipse.debug.tests.viewer.model.FilterTests.doTestRefreshUnrealizedFilteredElement(FilterTests.java:337)
at org.eclipse.debug.tests.viewer.model.FilterTests.testRefreshUnrealizedFilteredElement(FilterTests.java:300)
at org.eclipse.debug.tests.viewer.model.FilterTests.runTest(FilterTests.java:92)
60.108
testViewToModelCountSuccess0.008
testViewToModelIndexSuccess0.016
testClearLastFromFiltersSuccess0.013
testAddAlreadyFilteredSuccess0.008
testRemoveMiddleElementFromFiltersSuccess0.008
testRemoveLastFromFiltersSuccess0.014
testClearFirstElementFromFiltersSuccess0.008
testRemoveFirstElementFromFiltersSuccess0.008
testClearMiddleElementFromFiltersSuccess0.015
testRegression200325Success0.009
testCoalesceSuccess0.010
testSaveRestoreSuccess0.011
testDynamicBindingSuccess0.020
testNoDefaultBindingSuccess0.008
testSingleBindingSuccess0.010
testNoPrimaryBindingSuccess0.008
testBindingChangeNotificationSuccess0.010
testDefaultBindingSuccess0.007
testRenderingTypesSuccess0.008
testRenderingTypeNamesSuccess0.008
testDefaultWithoutPrimaryBindingSuccess0.009
testPrimaryBindingSuccess0.008
testDoubleBindingSuccess0.008
testCreateDeleteEFSSuccess0.375
testRenameSharedConfigurationSuccess0.035
testSetAttributesSuccess0.015
testGetProjectMappedResource1Success0.009
testGetProjectMappedResource2Success0.008
testGetProjectMappedResource3Success0.008
testGetProjectMappedResource4Success0.008
testNullLaunchConfigurationInLaunchSuccess0.041
testSetNullAttributesSuccess0.014
testLocalCopySuccess0.021
testLocalNameSuccess0.013
testGetTypeImageFromURISuccess0.019
testWorkingCopyGetLocationSuccess0.008
testPersistIndexSuccess0.087
testIllegalFileSepCharNameSuccess0.007
testCreateLocalConfigurationSuccess0.014
testDoubleSaveSuccess0.023
testDeleteLocalConfigurationSuccess0.014
testNestedWorkingCopyLocalConfigurationSuccess0.015
testLaunchTimeStampSuccess0.024
testLegalFileSepCharNameSuccess0.010
testGetTyeImageSuccess0.008
testIllegalCharNameSuccess0.009
testDeleteSharedConfigurationSuccess0.019
testMoveSharedToLocalConfigurationSuccess0.061
testDeleteProjectWithSharedConfigSuccess0.075
testCreateDeleteEFSLinkSuccess0.040
testRenameLocalConfigurationSuccess0.020
testImportSuccess0.042
testCreateSharedConfigurationSuccess0.018
testMoveLocalToSharedConfigurationSuccess0.023
testRenameAndMoveSharedSuccess0.039
testMapAttributePersistenceSuccess0.041
testSharedCopySuccess0.041
testSharedNameSuccess0.020
testEFSProjectRenameSuccess0.422
testSetAttributePersistenceSuccess0.047
testGetAttributesSuccess0.015
testWithEllipsesSuccess0.007
testWithoutEllipsesSuccess0.007
testWithoutDBCSAccleratorSuccess0.019
testHistoryAdditionSuccess0.015
testLaunchHistorySizeSuccess0.016
testRenameConfigHistoryUpdateSuccess0.022
testHistoryReoderingSuccess0.015
testHistoriesInSyncSuccess0.011
testDeleteLaunchConfigurationHistoryUpdateSuccess0.014
testBecomeFavoriteSuccess0.017
testRenameFavoriteSuccess0.022
testDeleteConfigurationSuccess0.016
testRenameBecomeFavoriteSuccess0.018
testRenameUnFavoriteSuccess0.021
testUnFavoriteSuccess0.021
testValidateConfigBadCharNameSuccess0.008
testValidateConfigBadNameSuccess0.007
testGenerateValidNameSuccess0.008
testGenerateBadConfigNameSuccess0.008
testGenereateConfigNameSuccess0.007
testGenerateConfigNameReservedNameSuccess0.007
testCancelledPreLaunchCheckSuccess0.017
testCancelledBuildForLaunchSuccess0.014
testGenereateConfigNameBadCharSuccess0.008
testGenerateConflictingNameSuccess0.017
testGenerateBadCharConflictSuccess0.019
testGenerateNameExistingConfigSuccess0.018
testCancelledFinalLaunchCheckSuccess0.014
testValidateConfigGoodNameSuccess0.007
testGenerateBadNameConflictSuccess0.013
testRemoveAccSuccess0.006
testNPE_Bug484882Success62.062
testSelectedResourceSuccess0.445
testSpecificResourceSuccess0.008
testSelectionsFolderSuccess0.029
testWorkingSetSuccess0.012
testWorkspaceScopeSuccess0.008
testSelectionsProjectSuccess0.018
testEmptyResourceSetSuccess0.009
testResourceMementoSuccess0.009
testRefreshScopeComparatorSuccess0.010
testAllInOneSuccess0.244
testDoubleQuoted1Success0.222
testDoubleQuoted2Success0.233
testDoubleQuoted3Success0.225
testDoubleQuoted4Success0.220
testDoubleQuoted5Success0.221
testEmptySuccess0.229
test1argSuccess0.214
test2argSuccess0.235
testEscapeDoubleQuote1Success0.228
testEscapeDoubleQuote2Success0.217
testWindows1Success0.224
testWindows2Success0.238
testWindows3Success0.235
testWindows4Success0.283
testWindows5Success0.259
testDoubleQuotedWithSpace1Success0.340
testDoubleQuotedWithSpace2Success0.217
testSingleQuoted1Success0.216
testSingleQuoted2Success0.216
test100argSuccess0.249
testEscapeSuccess0.215
testDisconnectedAndWriteProcessesSuccess22.662
testTerminatedAndWriteProcessesSuccess14.590
testDisconnectedAndWriteTargetsSuccess20.127
testTerminatedAndWriteTargetsSuccess14.809
testStatusHandlerExtensionSuccess0.010
testDisableStatusHandlersSuccess0.012
testStepFitlersExtension_01Success0.009
testStepFitlersExtension_02Success0.009
testShowAllConsolesSuccess5.716
testConsoleOutputStreamLastRSuccess0.669
testConsoleOutputStreamClosedSuccess0.009
testSetNullEncodingSuccess0.008
testConsoleOutputStreamDocumentStreamClosedSuccess0.022
testConsoleOutputStreamDocumentClosedSuccess0.008
testConsoleOutputStreamEncodingSuccess0.829
testTerminatedSuccess8.160
testWaitForOutputSuccess7.121
testAdoptSuccess0.131
testDelaySuccess2.022
testNoneSuccess0.028
testAdoptComplexSuccess0.049
testRenameSuccess0.029
Properties »

Back to top